Reaction Details
TargetCarbonic anhydrase 7
LigandBDBM50429919
Substrate/Competitorn/a
Meas. Tech.ChEMBL_945279 (CHEMBL2340477)
pH7±n/a
Kd 147±n/a nM
Commentsextracted
Citation Dudutiene, VZubriene, ASmirnov, AGylyte, JTimm, DManakova, EGražulis, SMatulis, D 4-Substituted-2,3,5,6-tetrafluorobenzenesulfonamides as inhibitors of carbonic anhydrases I, II, VII, XII, and XIII. Bioorg Med Chem21:2093-106 (2013) 
 
Carbonic anhydrase 7
Name:Carbonic anhydrase 7
Type:Enzyme
Mol. Mass.:29664.11
Organism:Homo sapiens (Human)
Description:Human cloned isozyme.
Residue:264
BDBM50429919
NameBDBM50429919
Synonyms:CHEMBL2333814
TypeSmall organic molecule
Emp. Form.C12H14F4N2O4S
Mol. Mass.358.309
SMILESNS(=O)(=O)c1c(F)c(F)c(NCCCCCC(O)=O)c(F)c1F