Reaction Details
TargetCarbonic anhydrase 2
LigandBDBM50429906
Substrate/Competitorn/a
Meas. Tech.ChEMBL_945280 (CHEMBL2340478)
pH7±n/a
Kd 6.7±n/a nM
Commentsextracted
Citation Dudutiene, VZubriene, ASmirnov, AGylyte, JTimm, DManakova, EGražulis, SMatulis, D 4-Substituted-2,3,5,6-tetrafluorobenzenesulfonamides as inhibitors of carbonic anhydrases I, II, VII, XII, and XIII. Bioorg Med Chem21:2093-106 (2013) 
 
Carbonic anhydrase 2
Name:Carbonic anhydrase 2
Type:Enzyme
Mol. Mass.:29250.71
Organism:Homo sapiens (Human)
Description:P00918
Residue:260
BDBM50429906
NameBDBM50429906
Synonyms:CHEMBL2333398
TypeSmall organic molecule
Emp. Form.C14H6F4N4O2S3
Mol. Mass.434.412
SMILESNS(=O)(=O)c1c(F)c(F)c(SC2=S=Nn3c2nc2ccccc32)c(F)c1F