Reaction Details
TargetCarbonic anhydrase 2
LigandBDBM50429918
Substrate/Competitorn/a
Meas. Tech.ChEMBL_945280 (CHEMBL2340478)
pH7±n/a
Kd 4.0±n/a nM
Commentsextracted
Citation Dudutiene, VZubriene, ASmirnov, AGylyte, JTimm, DManakova, EGražulis, SMatulis, D 4-Substituted-2,3,5,6-tetrafluorobenzenesulfonamides as inhibitors of carbonic anhydrases I, II, VII, XII, and XIII. Bioorg Med Chem21:2093-106 (2013) 
 
Carbonic anhydrase 2
Name:Carbonic anhydrase 2
Type:Enzyme
Mol. Mass.:29250.71
Organism:Homo sapiens (Human)
Description:P00918
Residue:260
BDBM50429918
NameBDBM50429918
Synonyms:CHEMBL2333815
TypeSmall organic molecule
Emp. Form.C12H7F4NO2S2
Mol. Mass.337.313
SMILESNS(=O)(=O)c1c(F)c(F)c(Sc2ccccc2)c(F)c1F