Reaction Details
TargetCarbonic anhydrase 2
LigandBDBM50429922
Substrate/Competitorn/a
Meas. Tech.ChEMBL_945280 (CHEMBL2340478)
pH7±n/a
Kd 2.0±n/a nM
Commentsextracted
Citation Dudutiene, VZubriene, ASmirnov, AGylyte, JTimm, DManakova, EGražulis, SMatulis, D 4-Substituted-2,3,5,6-tetrafluorobenzenesulfonamides as inhibitors of carbonic anhydrases I, II, VII, XII, and XIII. Bioorg Med Chem21:2093-106 (2013) 
 
Carbonic anhydrase 2
Name:Carbonic anhydrase 2
Type:Enzyme
Mol. Mass.:29250.71
Organism:Homo sapiens (Human)
Description:P00918
Residue:260
BDBM50429922
NameBDBM50429922
Synonyms:CHEMBL2333418 | carbonic anhydrase (CA) inhibitors, benzenesulphonamide ligand, 11
TypeSmall organic molecule
Emp. Form.C9H9F4NO2S2
Mol. Mass.303.297
SMILESCCCSc1c(F)c(F)c(c(F)c1F)S(N)(=O)=O