Reaction Details
TargetCarbonic anhydrase 2
LigandBDBM50429925
Substrate/Competitorn/a
Meas. Tech.ChEMBL_945280 (CHEMBL2340478)
pH7±n/a
Kd 27±n/a nM
Commentsextracted
Citation Dudutiene, VZubriene, ASmirnov, AGylyte, JTimm, DManakova, EGražulis, SMatulis, D 4-Substituted-2,3,5,6-tetrafluorobenzenesulfonamides as inhibitors of carbonic anhydrases I, II, VII, XII, and XIII. Bioorg Med Chem21:2093-106 (2013) 
 
Carbonic anhydrase 2
Name:Carbonic anhydrase 2
Type:Enzyme
Mol. Mass.:29250.71
Organism:Homo sapiens (Human)
Description:P00918
Residue:260
BDBM50429925
NameBDBM50429925
Synonyms:2,3,4,5,6-Pentafluorobenzenesulfonamide | CHEMBL2333413
TypeSmall organic molecule
Emp. Form.C6H2F5NO2S
Mol. Mass.247.143
SMILESNS(=O)(=O)c1c(F)c(F)c(F)c(F)c1F