Reaction Details
TargetFatty acid-binding protein, heart
LigandBDBM50429941
Substrate/Competitorn/a
Meas. Tech.ChEMBL_945782 (CHEMBL2339129)
IC50 1650±n/a nM
Citation Beniyama, YMatsuno, KMiyachi, H Structure-guided design, synthesis and in vitro evaluation of a series of pyrazole-based fatty acid binding protein (FABP) 3 ligands. Bioorg Med Chem Lett23:1662-6 (2013) 
 
Fatty acid-binding protein, heart
Name:Fatty acid-binding protein, heart
Type:PROTEIN
Mol. Mass.:14858.36
Organism:Homo sapiens (Human)
Description:ChEMBL_1463784
Residue:133
BDBM50429941
NameBDBM50429941
Synonyms:CHEMBL2334258
TypeSmall organic molecule
Emp. Form.C26H24N2O4
Mol. Mass.428.4798
SMILESCOc1ccc(cc1)-n1nc(cc1-c1ccccc1)-c1ccccc1OCCCC(O)=O