Reaction Details
TargetFatty acid-binding protein, heart
LigandBDBM50429943
Substrate/Competitorn/a
Meas. Tech.ChEMBL_945782 (CHEMBL2339129)
IC50 22300±n/a nM
Citation Beniyama, YMatsuno, KMiyachi, H Structure-guided design, synthesis and in vitro evaluation of a series of pyrazole-based fatty acid binding protein (FABP) 3 ligands. Bioorg Med Chem Lett23:1662-6 (2013) 
 
Fatty acid-binding protein, heart
Name:Fatty acid-binding protein, heart
Type:PROTEIN
Mol. Mass.:14858.36
Organism:Homo sapiens (Human)
Description:ChEMBL_1463784
Residue:133
BDBM50429943
NameBDBM50429943
Synonyms:CHEMBL2334253
TypeSmall organic molecule
Emp. Form.C26H23BrN2O3
Mol. Mass.491.376
SMILESOC(=O)CCCCOc1ccccc1-c1cc(-c2ccc(Br)cc2)n(n1)-c1ccccc1