Reaction Details
TargetOligo-1,6-glucosidase IMA1
LigandBDBM50341204
Substrate/Competitorn/a
Meas. Tech.ChEMBL_947691 (CHEMBL2341130)
IC50 2350000±n/a nM
Citation Mata, RCristians, SEscandón-Rivera, SJuárez-Reyes, KRivero-Cruz, I Mexican antidiabetic herbs: valuable sources of inhibitors ofa-glucosidases. J Nat Prod76:468-83 (2013) 
 
Oligo-1,6-glucosidase IMA1
Name:Oligo-1,6-glucosidase IMA1
Type:Protein
Mol. Mass.:68577.59
Organism:Saccharomyces cerevisiae S288c (Baker's yeast)
Description:n/a
Residue:589
BDBM50341204
NameBDBM50341204
Synonyms:(Z)-3-butylidenephthalide | CHEMBL1765390
TypeSmall organic molecule
Emp. Form.C12H12O2
Mol. Mass.188.2225
SMILESCCC\C=C1\OC(=O)c2ccccc12