Reaction Details
TargetReceptor-type tyrosine-protein kinase FLT3
LigandBDBM23411
Substrate/Competitorn/a
Meas. Tech.ChEMBL_942896 (CHEMBL2342404)
IC50>10000±n/a nM
Citation Chin, YWKong, JYHan, SY Flavonoids as receptor tyrosine kinase FLT3 inhibitors. Bioorg Med Chem Lett23:1768-70 (2013) 
 
Receptor-type tyrosine-protein kinase FLT3
Name:Receptor-type tyrosine-protein kinase FLT3
Type:Enzyme
Mol. Mass.:112888.62
Organism:Homo sapiens (Human)
Description:P36888
Residue:993
BDBM23411
NameBDBM23411
Synonyms:5,6,7-trihydroxy-2-(4-hydroxyphenyl)-4H-chromen-4-one Scutellarein Scutellarein (28) | US10252984, Table 2.2
Typeflavone
Emp. Form.C15H10O6
Mol. Mass.286.2363
SMILESOc1ccc(cc1)-c1cc(=O)c2c(O)c(O)c(O)cc2o1