Reaction Details
TargetReceptor-type tyrosine-protein kinase FLT3
LigandBDBM15236
Substrate/Competitorn/a
Meas. Tech.ChEMBL_942896 (CHEMBL2342404)
IC50 1690±n/a nM
Citation Chin, YWKong, JYHan, SY Flavonoids as receptor tyrosine kinase FLT3 inhibitors. Bioorg Med Chem Lett23:1768-70 (2013) 
 
Receptor-type tyrosine-protein kinase FLT3
Name:Receptor-type tyrosine-protein kinase FLT3
Type:Enzyme
Mol. Mass.:112888.62
Organism:Homo sapiens (Human)
Description:P36888
Residue:993
BDBM15236
NameBDBM15236
Synonyms:3,5,7-trihydroxy-2-(3,4,5-trihydroxyphenyl)-4H-chromen-4-one CHEMBL164 Myricetin Myricetin (Myr) | cid_5281672
TypeSmall organic molecule
Emp. Form.C15H10O8
Mol. Mass.318.2351
SMILESOc1cc(O)c2c(c1)oc(-c1cc(O)c(O)c(O)c1)c(O)c2=O