Reaction Details
TargetCarbonic anhydrase 2
LigandBDBM50344898
Substrate/Competitorn/a
Meas. Tech.ChEMBL_943321 (CHEMBL2340377)
Ki 690000±n/a nM
Citation Vullo, DIsik, SDel Prete, SDe Luca, VCarginale, VScozzafava, ASupuran, CTCapasso, C Anion inhibition studies of thea-carbonic anhydrase from the pathogenic bacterium Vibrio cholerae. Bioorg Med Chem Lett23:1636-8 (2013) 
 
Carbonic anhydrase 2
Name:Carbonic anhydrase 2
Type:Enzyme
Mol. Mass.:29250.71
Organism:Homo sapiens (Human)
Description:P00918
Residue:260
BDBM50344898
NameBDBM50344898
Synonyms:CHEMBL1081267 | sodium perruthenate
TypeSmall organic molecule
Emp. Form.O4Ru
Mol. Mass.165.07
SMILESO=[Ru-](=O)(=O)=O