Reaction Details
TargetC-C chemokine receptor type 1
LigandBDBM50430275
Substrate/Competitorn/a
Meas. Tech.ChEMBL_943371 (CHEMBL2340879)
IC50 0.360000±n/a nM
Citation Hossain, NIvanova, SBergare, JEriksson, T Spirocyclic compounds, potent CCR1 antagonists. Bioorg Med Chem Lett23:1883-6 (2013) 
 
C-C chemokine receptor type 1
Name:C-C chemokine receptor type 1
Type:Enzyme
Mol. Mass.:41180.69
Organism:Homo sapiens (Human)
Description:P32246
Residue:355
BDBM50430275
NameBDBM50430275
Synonyms:CHEMBL2332933
TypeSmall organic molecule
Emp. Form.C23H26F2N2O4
Mol. Mass.432.4603
SMILESCC(=O)Nc1ccc(F)cc1OC[C@@H](O)CN1CCC2(Cc3cc(F)ccc3O2)CC1