Reaction Details
TargetC-C chemokine receptor type 1
LigandBDBM50430284
Substrate/Competitorn/a
Meas. Tech.ChEMBL_943371 (CHEMBL2340879)
IC50 0.900000±n/a nM
Citation Hossain, NIvanova, SBergare, JEriksson, T Spirocyclic compounds, potent CCR1 antagonists. Bioorg Med Chem Lett23:1883-6 (2013) 
 
C-C chemokine receptor type 1
Name:C-C chemokine receptor type 1
Type:Enzyme
Mol. Mass.:41180.69
Organism:Homo sapiens (Human)
Description:P32246
Residue:355
BDBM50430284
NameBDBM50430284
Synonyms:CHEMBL2332930
TypeSmall organic molecule
Emp. Form.C24H29ClN2O5
Mol. Mass.460.95
SMILESCOc1ccc(NC(C)=O)c(OC[C@@H](O)CN2CCC3(Cc4cc(Cl)ccc4O3)CC2)c1