Reaction Details
TargetFocal adhesion kinase 1
LigandBDBM50430287
Substrate/Competitorn/a
Meas. Tech.ChEMBL_943791 (CHEMBL2345804)
IC50 640±n/a nM
Citation Tomita, NHayashi, YSuzuki, SOomori, YAramaki, YMatsushita, YIwatani, MIwata, HOkabe, AAwazu, YIsono, OSkene, RJHosfield, DJMiki, HKawamoto, THori, ABaba, A Structure-based discovery of cellular-active allosteric inhibitors of FAK. Bioorg Med Chem Lett23:1779-85 (2013) 
 
Focal adhesion kinase 1
Name:Focal adhesion kinase 1
Type:Tyrosine-protein kinase
Mol. Mass.:119233.17
Organism:Homo sapiens (Human)
Description:Q05397
Residue:1052
BDBM50430287
NameBDBM50430287
Synonyms:CHEMBL2333444
TypeSmall organic molecule
Emp. Form.C22H26N4O2S
Mol. Mass.410.532
SMILESCN1c2ccc(NCc3ccc(cc3)C(C)(C)C)cc2-c2c(cnn2C)S1(=O)=O