Reaction Details
TargetDual specificity mitogen-activated protein kinase kinase 1
LigandBDBM50430287
Substrate/Competitorn/a
Meas. Tech.ChEMBL_943782 (CHEMBL2345795)
IC50>10000±n/a nM
Citation Tomita, NHayashi, YSuzuki, SOomori, YAramaki, YMatsushita, YIwatani, MIwata, HOkabe, AAwazu, YIsono, OSkene, RJHosfield, DJMiki, HKawamoto, THori, ABaba, A Structure-based discovery of cellular-active allosteric inhibitors of FAK. Bioorg Med Chem Lett23:1779-85 (2013) 
 
Dual specificity mitogen-activated protein kinase kinase 1
Name:Dual specificity mitogen-activated protein kinase kinase 1
Type:Other Protein Type
Mol. Mass.:43439.03
Organism:Homo sapiens (Human)
Description:Full-length human MEK-1 was generated by PCR and purified as a fusion protein from Escherichia coli lysates.
Residue:393
BDBM50430287
NameBDBM50430287
Synonyms:CHEMBL2333444
TypeSmall organic molecule
Emp. Form.C22H26N4O2S
Mol. Mass.410.532
SMILESCN1c2ccc(NCc3ccc(cc3)C(C)(C)C)cc2-c2c(cnn2C)S1(=O)=O