Reaction Details
TargetReceptor tyrosine-protein kinase erbB-2
LigandBDBM50430289
Substrate/Competitorn/a
Meas. Tech.ChEMBL_943786 (CHEMBL2345799)
IC50>10000±n/a nM
Citation Tomita, NHayashi, YSuzuki, SOomori, YAramaki, YMatsushita, YIwatani, MIwata, HOkabe, AAwazu, YIsono, OSkene, RJHosfield, DJMiki, HKawamoto, THori, ABaba, A Structure-based discovery of cellular-active allosteric inhibitors of FAK. Bioorg Med Chem Lett23:1779-85 (2013) 
 
Receptor tyrosine-protein kinase erbB-2
Name:Receptor tyrosine-protein kinase erbB-2
Type:n/a
Mol. Mass.:137894.47
Organism:Homo sapiens (Human)
Description:P04626
Residue:1255
BDBM50430289
NameBDBM50430289
Synonyms:CHEMBL2333445
TypeSmall organic molecule
Emp. Form.C18H17N3O2S
Mol. Mass.339.411
SMILESCCc1ccc(cc1)-c1ccc2N(C)S(=O)(=O)c3c[nH]nc3-c2c1