Reaction Details
TargetProto-oncogene tyrosine-protein kinase Src
LigandBDBM50430288
Substrate/Competitorn/a
Meas. Tech.ChEMBL_943785 (CHEMBL2345798)
IC50>10000±n/a nM
Citation Tomita, NHayashi, YSuzuki, SOomori, YAramaki, YMatsushita, YIwatani, MIwata, HOkabe, AAwazu, YIsono, OSkene, RJHosfield, DJMiki, HKawamoto, THori, ABaba, A Structure-based discovery of cellular-active allosteric inhibitors of FAK. Bioorg Med Chem Lett23:1779-85 (2013) 
 
Proto-oncogene tyrosine-protein kinase Src
Name:Proto-oncogene tyrosine-protein kinase Src
Type:Protein
Mol. Mass.:59838.60
Organism:Homo sapiens (Human)
Description:P12931
Residue:536
BDBM50430288
NameBDBM50430288
Synonyms:CHEMBL2333435
TypeSmall organic molecule
Emp. Form.C19H19N3O2S
Mol. Mass.353.438
SMILESCCc1ccc(cc1)-c1ccc2N(C)S(=O)(=O)c3cnn(C)c3-c2c1