Reaction Details
TargetFocal adhesion kinase 1
LigandBDBM50430300
Substrate/Competitorn/a
Meas. Tech.ChEMBL_943791 (CHEMBL2345804)
IC50 3500±n/a nM
Citation Tomita, NHayashi, YSuzuki, SOomori, YAramaki, YMatsushita, YIwatani, MIwata, HOkabe, AAwazu, YIsono, OSkene, RJHosfield, DJMiki, HKawamoto, THori, ABaba, A Structure-based discovery of cellular-active allosteric inhibitors of FAK. Bioorg Med Chem Lett23:1779-85 (2013) 
 
Focal adhesion kinase 1
Name:Focal adhesion kinase 1
Type:Tyrosine-protein kinase
Mol. Mass.:119233.17
Organism:Homo sapiens (Human)
Description:Q05397
Residue:1052
BDBM50430300
NameBDBM50430300
Synonyms:CHEMBL2333432
TypeSmall organic molecule
Emp. Form.C17H14N4O3S
Mol. Mass.354.383
SMILESCN1c2ccc(cc2-c2n[nH]cc2S1(=O)=O)-c1ccc(cc1)C(N)=O