Reaction Details
TargetRho-associated protein kinase 2
LigandBDBM50430332
Substrate/Competitorn/a
Meas. Tech.ChEMBL_943818 (CHEMBL2346267)
IC50 23±n/a nM
Citation Chowdhury, SChen, YTFang, XGrant, WPocas, JCameron, MDRuiz, CLin, LPark, HSchröter, TBannister, TDLograsso, PVFeng, Y Amino acid derived quinazolines as Rock/PKA inhibitors. Bioorg Med Chem Lett23:1592-9 (2013) 
 
Rho-associated protein kinase 2
Name:Rho-associated protein kinase 2
Type:Protein
Mol. Mass.:160885.43
Organism:Homo sapiens (Human)
Description:O75116
Residue:1388
BDBM50430332
NameBDBM50430332
Synonyms:CHEMBL2334289
TypeSmall organic molecule
Emp. Form.C23H20N4O
Mol. Mass.368.4311
SMILESO=c1[nH]c(nc2ccc(cc12)-c1ccncc1)[C@@H]1CNC[C@H]1c1ccccc1