Reaction Details
TargetRho-associated protein kinase 2
LigandBDBM50430337
Substrate/Competitorn/a
Meas. Tech.ChEMBL_943818 (CHEMBL2346267)
IC50 371±n/a nM
Citation Chowdhury, SChen, YTFang, XGrant, WPocas, JCameron, MDRuiz, CLin, LPark, HSchröter, TBannister, TDLograsso, PVFeng, Y Amino acid derived quinazolines as Rock/PKA inhibitors. Bioorg Med Chem Lett23:1592-9 (2013) 
 
Rho-associated protein kinase 2
Name:Rho-associated protein kinase 2
Type:Protein
Mol. Mass.:160885.43
Organism:Homo sapiens (Human)
Description:O75116
Residue:1388
BDBM50430337
NameBDBM50430337
Synonyms:CHEMBL2333881
TypeSmall organic molecule
Emp. Form.C25H28FN7
Mol. Mass.445.5351
SMILESCN(C)CCNc1nc(nc2ccc(cc12)-c1cn[nH]c1)[C@@H]1CNC[C@H]1c1ccc(F)cc1