Reaction Details
TargetRho-associated protein kinase 2
LigandBDBM50430344
Substrate/Competitorn/a
Meas. Tech.ChEMBL_943818 (CHEMBL2346267)
IC50 627±n/a nM
Citation Chowdhury, SChen, YTFang, XGrant, WPocas, JCameron, MDRuiz, CLin, LPark, HSchröter, TBannister, TDLograsso, PVFeng, Y Amino acid derived quinazolines as Rock/PKA inhibitors. Bioorg Med Chem Lett23:1592-9 (2013) 
 
Rho-associated protein kinase 2
Name:Rho-associated protein kinase 2
Type:Protein
Mol. Mass.:160885.43
Organism:Homo sapiens (Human)
Description:O75116
Residue:1388
BDBM50430344
NameBDBM50430344
Synonyms:CHEMBL2333888
TypeSmall organic molecule
Emp. Form.C24H28FN7
Mol. Mass.433.5244
SMILESCN(C)CCN(C)c1nc(nc2ccc(cc12)-c1cn[nH]c1)[C@H](N)Cc1cccc(F)c1