Reaction Details
TargetRho-associated protein kinase 2
LigandBDBM50430357
Substrate/Competitorn/a
Meas. Tech.ChEMBL_943818 (CHEMBL2346267)
IC50 8.0±n/a nM
Citation Chowdhury, SChen, YTFang, XGrant, WPocas, JCameron, MDRuiz, CLin, LPark, HSchröter, TBannister, TDLograsso, PVFeng, Y Amino acid derived quinazolines as Rock/PKA inhibitors. Bioorg Med Chem Lett23:1592-9 (2013) 
 
Rho-associated protein kinase 2
Name:Rho-associated protein kinase 2
Type:Protein
Mol. Mass.:160885.43
Organism:Homo sapiens (Human)
Description:O75116
Residue:1388
BDBM50430357
NameBDBM50430357
Synonyms:CHEMBL2333896
TypeSmall organic molecule
Emp. Form.C19H16ClN5O2
Mol. Mass.381.816
SMILESCOc1cc(cc2c1nc([nH]c2=O)C(N)c1cccc(Cl)c1)-c1cn[nH]c1