Reaction Details
TargetRho-associated protein kinase 2
LigandBDBM50430375
Substrate/Competitorn/a
Meas. Tech.ChEMBL_943818 (CHEMBL2346267)
IC50 7.0±n/a nM
Citation Chowdhury, SChen, YTFang, XGrant, WPocas, JCameron, MDRuiz, CLin, LPark, HSchröter, TBannister, TDLograsso, PVFeng, Y Amino acid derived quinazolines as Rock/PKA inhibitors. Bioorg Med Chem Lett23:1592-9 (2013) 
 
Rho-associated protein kinase 2
Name:Rho-associated protein kinase 2
Type:Protein
Mol. Mass.:160885.43
Organism:Homo sapiens (Human)
Description:O75116
Residue:1388
BDBM50430375
NameBDBM50430375
Synonyms:CHEMBL2334291
TypeSmall organic molecule
Emp. Form.C22H21N5O
Mol. Mass.371.435
SMILESCc1[nH]ncc1-c1ccc2nc([nH]c(=O)c2c1)[C@@H]1CNC[C@H]1c1ccccc1