Reaction Details
TargetSerine/threonine-protein kinase MRCK alpha
LigandBDBM50430367
Substrate/Competitorn/a
Meas. Tech.ChEMBL_943803 (CHEMBL2346252)
IC50>1000±n/a nM
Citation Chowdhury, SChen, YTFang, XGrant, WPocas, JCameron, MDRuiz, CLin, LPark, HSchröter, TBannister, TDLograsso, PVFeng, Y Amino acid derived quinazolines as Rock/PKA inhibitors. Bioorg Med Chem Lett23:1592-9 (2013) 
 
Serine/threonine-protein kinase MRCK alpha
Name:Serine/threonine-protein kinase MRCK alpha
Type:Protien
Mol. Mass.:197305.74
Organism:Homo sapiens (Human)
Description:Q5VT25
Residue:1732
BDBM50430367
NameBDBM50430367
Synonyms:CHEMBL2333909
TypeSmall organic molecule
Emp. Form.C20H19N5O2
Mol. Mass.361.3972
SMILESCOc1ccc(C[C@H](N)c2nc3ccc(cc3c(=O)[nH]2)-c2cn[nH]c2)cc1