Reaction Details
TargetSerine/threonine-protein kinase MRCK alpha
LigandBDBM50430368
Substrate/Competitorn/a
Meas. Tech.ChEMBL_943803 (CHEMBL2346252)
IC50>1000±n/a nM
Citation Chowdhury, SChen, YTFang, XGrant, WPocas, JCameron, MDRuiz, CLin, LPark, HSchröter, TBannister, TDLograsso, PVFeng, Y Amino acid derived quinazolines as Rock/PKA inhibitors. Bioorg Med Chem Lett23:1592-9 (2013) 
 
Serine/threonine-protein kinase MRCK alpha
Name:Serine/threonine-protein kinase MRCK alpha
Type:Protien
Mol. Mass.:197305.74
Organism:Homo sapiens (Human)
Description:Q5VT25
Residue:1732
BDBM50430368
NameBDBM50430368
Synonyms:CHEMBL2333908
TypeSmall organic molecule
Emp. Form.C20H18FN5O2
Mol. Mass.379.3876
SMILESCOc1cc(cc2c1nc([nH]c2=O)[C@H](N)Cc1cccc(F)c1)-c1cn[nH]c1