Reaction Details
TargetRho-associated protein kinase 1
LigandBDBM50430367
Substrate/Competitorn/a
Meas. Tech.ChEMBL_943815 (CHEMBL2346264)
IC50 16±n/a nM
Citation Chowdhury, SChen, YTFang, XGrant, WPocas, JCameron, MDRuiz, CLin, LPark, HSchröter, TBannister, TDLograsso, PVFeng, Y Amino acid derived quinazolines as Rock/PKA inhibitors. Bioorg Med Chem Lett23:1592-9 (2013) 
 
Rho-associated protein kinase 1
Name:Rho-associated protein kinase 1
Type:Serine/threonine-protein kinase
Mol. Mass.:158156.77
Organism:Homo sapiens (Human)
Description:Q13464
Residue:1354
BDBM50430367
NameBDBM50430367
Synonyms:CHEMBL2333909
TypeSmall organic molecule
Emp. Form.C20H19N5O2
Mol. Mass.361.3972
SMILESCOc1ccc(C[C@H](N)c2nc3ccc(cc3c(=O)[nH]2)-c2cn[nH]c2)cc1