Reaction Details
TargetMitogen-activated protein kinase 10
LigandBDBM50430339
Substrate/Competitorn/a
Meas. Tech.ChEMBL_943806 (CHEMBL2346255)
IC50>1000±n/a nM
Citation Chowdhury, SChen, YTFang, XGrant, WPocas, JCameron, MDRuiz, CLin, LPark, HSchröter, TBannister, TDLograsso, PVFeng, Y Amino acid derived quinazolines as Rock/PKA inhibitors. Bioorg Med Chem Lett23:1592-9 (2013) 
 
Mitogen-activated protein kinase 10
Name:Mitogen-activated protein kinase 10
Type:Enzyme
Mol. Mass.:52586.89
Organism:Homo sapiens (Human)
Description:n/a
Residue:464
BDBM50430339
NameBDBM50430339
Synonyms:CHEMBL2333879
TypeSmall organic molecule
Emp. Form.C23H24N6
Mol. Mass.384.4769
SMILESCN(C)c1nc(nc2ccc(cc12)-c1cn[nH]c1)[C@@H]1CNC[C@H]1c1ccccc1