Reaction Details
TargetMitogen-activated protein kinase 10
LigandBDBM50430333
Substrate/Competitorn/a
Meas. Tech.ChEMBL_943806 (CHEMBL2346255)
IC50>1000±n/a nM
Citation Chowdhury, SChen, YTFang, XGrant, WPocas, JCameron, MDRuiz, CLin, LPark, HSchröter, TBannister, TDLograsso, PVFeng, Y Amino acid derived quinazolines as Rock/PKA inhibitors. Bioorg Med Chem Lett23:1592-9 (2013) 
 
Mitogen-activated protein kinase 10
Name:Mitogen-activated protein kinase 10
Type:Enzyme
Mol. Mass.:52586.89
Organism:Homo sapiens (Human)
Description:n/a
Residue:464
BDBM50430333
NameBDBM50430333
Synonyms:CHEMBL2334288
TypeSmall organic molecule
Emp. Form.C19H17N5O2
Mol. Mass.347.3706
SMILESCOc1ccc(cc1)C(N)c1nc2ccc(cc2c(=O)[nH]1)-c1cn[nH]c1