Reaction Details
TargetMitogen-activated protein kinase 9
LigandBDBM50430370
Substrate/Competitorn/a
Meas. Tech.ChEMBL_943805 (CHEMBL2346254)
IC50>1000±n/a nM
Citation Chowdhury, SChen, YTFang, XGrant, WPocas, JCameron, MDRuiz, CLin, LPark, HSchröter, TBannister, TDLograsso, PVFeng, Y Amino acid derived quinazolines as Rock/PKA inhibitors. Bioorg Med Chem Lett23:1592-9 (2013) 
 
Mitogen-activated protein kinase 9
Name:Mitogen-activated protein kinase 9
Type:Enzyme
Mol. Mass.:48131.49
Organism:Homo sapiens (Human)
Description:JNK-2 was purchased from Upstate Cell Signaling Solutions (formerly Upstate Biotechnology).
Residue:424
BDBM50430370
NameBDBM50430370
Synonyms:CHEMBL2333906
TypeSmall organic molecule
Emp. Form.C19H16FN5O
Mol. Mass.349.3616
SMILESN[C@H](Cc1ccc(F)cc1)c1nc2ccc(cc2c(=O)[nH]1)-c1cn[nH]c1