Reaction Details
TargetMitogen-activated protein kinase 8
LigandBDBM50430357
Substrate/Competitorn/a
Meas. Tech.ChEMBL_943807 (CHEMBL2346256)
IC50>1000±n/a nM
Citation Chowdhury, SChen, YTFang, XGrant, WPocas, JCameron, MDRuiz, CLin, LPark, HSchröter, TBannister, TDLograsso, PVFeng, Y Amino acid derived quinazolines as Rock/PKA inhibitors. Bioorg Med Chem Lett23:1592-9 (2013) 
 
Mitogen-activated protein kinase 8
Name:Mitogen-activated protein kinase 8
Type:Enzyme
Mol. Mass.:48297.57
Organism:Homo sapiens (Human)
Description:JNK-1 was purchased from Upstate Cell Signaling Solutions (formerly Upstate Biotechnology).
Residue:427
BDBM50430357
NameBDBM50430357
Synonyms:CHEMBL2333896
TypeSmall organic molecule
Emp. Form.C19H16ClN5O2
Mol. Mass.381.816
SMILESCOc1cc(cc2c1nc([nH]c2=O)C(N)c1cccc(Cl)c1)-c1cn[nH]c1