Reaction Details
TargetMitogen-activated protein kinase 8
LigandBDBM50430333
Substrate/Competitorn/a
Meas. Tech.ChEMBL_943807 (CHEMBL2346256)
IC50>1000±n/a nM
Citation Chowdhury, SChen, YTFang, XGrant, WPocas, JCameron, MDRuiz, CLin, LPark, HSchröter, TBannister, TDLograsso, PVFeng, Y Amino acid derived quinazolines as Rock/PKA inhibitors. Bioorg Med Chem Lett23:1592-9 (2013) 
 
Mitogen-activated protein kinase 8
Name:Mitogen-activated protein kinase 8
Type:Enzyme
Mol. Mass.:48297.57
Organism:Homo sapiens (Human)
Description:JNK-1 was purchased from Upstate Cell Signaling Solutions (formerly Upstate Biotechnology).
Residue:427
BDBM50430333
NameBDBM50430333
Synonyms:CHEMBL2334288
TypeSmall organic molecule
Emp. Form.C19H17N5O2
Mol. Mass.347.3706
SMILESCOc1ccc(cc1)C(N)c1nc2ccc(cc2c(=O)[nH]1)-c1cn[nH]c1