Reaction Details
TargetKappa-type opioid receptor
LigandBDBM50430605
Substrate/Competitorn/a
Meas. Tech.ChEMBL_947789 (CHEMBL2342208)
EC50 2.2±n/a nM
Citation Greedy, BMBradbury, FThomas, MPGrivas, KCami-Kobeci, GArchambeau, ABosse, KClark, MJAceto, MLewis, JWTraynor, JRHusbands, SM Orvinols with mixed kappa/mu opioid receptor agonist activity. J Med Chem56:3207-16 (2013) 
 
Kappa-type opioid receptor
Name:Kappa-type opioid receptor
Type:G Protein-Coupled Receptor (GPCR)
Mol. Mass.:42648.76
Organism:Homo sapiens (Human)
Description:P41145
Residue:380
BDBM50430605
NameBDBM50430605
Synonyms:CHEMBL2338715 | Rel-Ethylketazocine
TypeSmall organic molecule
Emp. Form.C19H25NO2
Mol. Mass.299.4073
SMILESCC[C@]12CCN(CC3CC3)[C@H]([C@H]1C)C(=O)c1ccc(O)cc21