Reaction Details
TargetMu-type opioid receptor
LigandBDBM50430612
Substrate/Competitorn/a
Meas. Tech.ChEMBL_948258 (CHEMBL2340176)
Ki 0.490000±n/a nM
Citation Greedy, BMBradbury, FThomas, MPGrivas, KCami-Kobeci, GArchambeau, ABosse, KClark, MJAceto, MLewis, JWTraynor, JRHusbands, SM Orvinols with mixed kappa/mu opioid receptor agonist activity. J Med Chem56:3207-16 (2013) 
 
Mu-type opioid receptor
Name:Mu-type opioid receptor
Type:G Protein-Coupled Receptor (GPCR)
Mol. Mass.:44503.11
Organism:Rattus norvegicus (rat)
Description:Competition binding assays were carried out using membrane preparations from transfected HN9.10 cells that constitutively expressed the mu opioid receptor.
Residue:398
BDBM50430612
NameBDBM50430612
Synonyms:CHEMBL2338724
TypeSmall organic molecule
Emp. Form.C31H43NO4
Mol. Mass.493.6774
SMILESCO[C@]12CC[C@@]3(C[C@@H]1[C@@H](O)CCC1CCCC1)[C@H]1Cc4ccc(O)c5O[C@@H]2[C@]3(CCN1CC1CC1)c45