Reaction Details
TargetMu-type opioid receptor
LigandBDBM50430595
Substrate/Competitorn/a
Meas. Tech.ChEMBL_947792 (CHEMBL2342211)
EC50 2.5±n/a nM
Citation Greedy, BMBradbury, FThomas, MPGrivas, KCami-Kobeci, GArchambeau, ABosse, KClark, MJAceto, MLewis, JWTraynor, JRHusbands, SM Orvinols with mixed kappa/mu opioid receptor agonist activity. J Med Chem56:3207-16 (2013) 
 
Mu-type opioid receptor
Name:Mu-type opioid receptor
Type:G Protein-Coupled Receptor (GPCR)
Mol. Mass.:44503.11
Organism:Rattus norvegicus (rat)
Description:Competition binding assays were carried out using membrane preparations from transfected HN9.10 cells that constitutively expressed the mu opioid receptor.
Residue:398
BDBM50430595
NameBDBM50430595
Synonyms:CHEMBL2338734
TypeSmall organic molecule
Emp. Form.C33H47NO4
Mol. Mass.521.7306
SMILESCO[C@]12CC[C@@]3(C[C@@H]1[C@@](C)(O)CCC1CCCCC1)[C@H]1Cc4ccc(O)c5O[C@@H]2[C@]3(CCN1CC1CC1)c45