Reaction Details
TargetMu-type opioid receptor
LigandBDBM50430604
Substrate/Competitorn/a
Meas. Tech.ChEMBL_948260 (CHEMBL2340178)
Ki 2.4±n/a nM
Citation Greedy, BMBradbury, FThomas, MPGrivas, KCami-Kobeci, GArchambeau, ABosse, KClark, MJAceto, MLewis, JWTraynor, JRHusbands, SM Orvinols with mixed kappa/mu opioid receptor agonist activity. J Med Chem56:3207-16 (2013) 
 
Mu-type opioid receptor
Name:Mu-type opioid receptor
Type:Enzyme Catalytic Domain
Mol. Mass.:11165.58
Organism:GUINEA PIG
Description:P97266
Residue:98
BDBM50430604
NameBDBM50430604
Synonyms:CHEMBL2338755
TypeSmall organic molecule
Emp. Form.C30H43NO4
Mol. Mass.481.6667
SMILESCCCCC[C@@](C)(O)[C@H]1C[C@]23CC[C@]1(OC)[C@@H]1Oc4c5c(C[C@H]2N(CC2CC2)CC[C@@]315)ccc4O