Reaction Details
TargetProstaglandin G/H synthase 1
LigandBDBM22971
Substrate/Competitorn/a
Meas. Tech.ChEMBL_942525 (CHEMBL2346180)
IC50 220±n/a nM
Citation Heinrich, DMFlanagan, JUJamieson, SMSilva, SRigoreau, LJTrivier, ERaynham, TTurnbull, APDenny, WA Synthesis and structure-activity relationships for 1-(4-(piperidin-1-ylsulfonyl)phenyl)pyrrolidin-2-ones as novel non-carboxylate inhibitors of the aldo-keto reductase enzyme AKR1C3. Eur J Med Chem62:738-44 (2013) 
 
Prostaglandin G/H synthase 1
Name:Prostaglandin G/H synthase 1
Type:Enzyme
Mol. Mass.:68692.62
Organism:Homo sapiens (Human)
Description:P23219
Residue:599
BDBM22971
NameBDBM22971
Synonyms:2-[(2,6-dichloro-3-methylphenyl)amino]benzoic acid Meclofenamate US11337935, Compound Meclofenamic-acid | US20240002326, Compound Meclofenamic acid
TypeSmall organic molecule
Emp. Form.C14H11Cl2NO2
Mol. Mass.296.149
SMILESCc1ccc(Cl)c(Nc2ccccc2C(O)=O)c1Cl