Reaction Details
TargetAldo-keto reductase family 1 member C3
LigandBDBM50134036
Substrate/Competitorn/a
Meas. Tech.ChEMBL_942527 (CHEMBL2346182)
IC50 560±n/a nM
Citation Heinrich, DMFlanagan, JUJamieson, SMSilva, SRigoreau, LJTrivier, ERaynham, TTurnbull, APDenny, WA Synthesis and structure-activity relationships for 1-(4-(piperidin-1-ylsulfonyl)phenyl)pyrrolidin-2-ones as novel non-carboxylate inhibitors of the aldo-keto reductase enzyme AKR1C3. Eur J Med Chem62:738-44 (2013) 
 
Aldo-keto reductase family 1 member C3
Name:Aldo-keto reductase family 1 member C3
Type:Enzyme
Mol. Mass.:36859.86
Organism:Homo sapiens (Human)
Description:P42330
Residue:323
BDBM50134036
NameBDBM50134036
Synonyms:2-(2,3-Dimethyl-phenylamino)-benzoic acid 2-(2,3-dimethylphenylamino)benzoic acid CI-473 INF-3355 Ponstel mefanamic acid
TypeSmall organic molecule
Emp. Form.C15H15NO2
Mol. Mass.241.2851
SMILESCc1cccc(Nc2ccccc2C(O)=O)c1C