Reaction Details
TargetAlpha-glucosidase MAL62
LigandBDBM18351
Substrate/Competitorn/a
Meas. Tech.ChEMBL_942538 (CHEMBL2346193)
IC50 425600000±n/a nM
Citation Sultan, SChoudhary, MIKhan, SNFatima, UAtif, MAli, RARahman, AUFatmi, MQ Fungal transformation of cedryl acetate anda-glucosidase inhibition assay, quantum mechanical calculations and molecular docking studies of its metabolites. Eur J Med Chem62:764-70 (2013) 
 
Alpha-glucosidase MAL62
Name:Alpha-glucosidase MAL62
Type:PROTEIN
Mol. Mass.:68174.43
Organism:Saccharomyces cerevisiae
Description:ChEMBL_942538
Residue:584
BDBM18351
NameBDBM18351
Synonyms:(2R,3R,4R,5S)-2-(Hydroxymethyl)piperidine-3,4,5-triol, 10 1-Deoxynojirimycin CHEMBL307429 US9181184, 1 | dNM
Typenatural product
Emp. Form.C6H13NO4
Mol. Mass.163.1717
SMILESOC[C@H]1NC[C@H](O)[C@@H](O)[C@@H]1O