Reaction Details
TargetcAMP and cAMP-inhibited cGMP 3',5'-cyclic phosphodiesterase 10A
LigandBDBM50430808
Substrate/Competitorn/a
Meas. Tech.ChEMBL_943440 (CHEMBL2341884)
Kd 505000±n/a nM
Citation Geschwindner, SDekker, NHorsefield, RTigerström, AJohansson, PScott, CWAlbert, JS Development of a plate-based optical biosensor fragment screening methodology to identify phosphodiesterase 10A inhibitors. J Med Chem56:3228-34 (2013) 
 
cAMP and cAMP-inhibited cGMP 3',5'-cyclic phosphodiesterase 10A
Name:cAMP and cAMP-inhibited cGMP 3',5'-cyclic phosphodiesterase 10A
Type:Protein
Mol. Mass.:88412.52
Organism:Homo sapiens (Human)
Description:Q9Y233
Residue:1055
BDBM50430808
NameBDBM50430808
Synonyms:CHEMBL2335133
TypeSmall organic molecule
Emp. Form.C12H11NO2
Mol. Mass.201.2212
SMILESCc1nc2ccccc2c(C(O)=O)c1C