Reaction Details
TargetcAMP and cAMP-inhibited cGMP 3',5'-cyclic phosphodiesterase 10A
LigandBDBM50430821
Substrate/Competitorn/a
Meas. Tech.ChEMBL_943440 (CHEMBL2341884)
Kd 540±n/a nM
Citation Geschwindner, SDekker, NHorsefield, RTigerström, AJohansson, PScott, CWAlbert, JS Development of a plate-based optical biosensor fragment screening methodology to identify phosphodiesterase 10A inhibitors. J Med Chem56:3228-34 (2013) 
 
cAMP and cAMP-inhibited cGMP 3',5'-cyclic phosphodiesterase 10A
Name:cAMP and cAMP-inhibited cGMP 3',5'-cyclic phosphodiesterase 10A
Type:Protein
Mol. Mass.:88412.52
Organism:Homo sapiens (Human)
Description:Q9Y233
Residue:1055
BDBM50430821
NameBDBM50430821
Synonyms:CHEMBL2335124
TypeSmall organic molecule
Emp. Form.C19H17NO3
Mol. Mass.307.3432
SMILESCCCOc1ccc(cc1)-c1cc(C(O)=O)c2ccccc2n1