Reaction Details
TargetcAMP and cAMP-inhibited cGMP 3',5'-cyclic phosphodiesterase 10A
LigandBDBM50430824
Substrate/Competitorn/a
Meas. Tech.ChEMBL_943441 (CHEMBL2341885)
IC50 1.7±n/a nM
Citation Geschwindner, SDekker, NHorsefield, RTigerström, AJohansson, PScott, CWAlbert, JS Development of a plate-based optical biosensor fragment screening methodology to identify phosphodiesterase 10A inhibitors. J Med Chem56:3228-34 (2013) 
 
cAMP and cAMP-inhibited cGMP 3',5'-cyclic phosphodiesterase 10A
Name:cAMP and cAMP-inhibited cGMP 3',5'-cyclic phosphodiesterase 10A
Type:Protein
Mol. Mass.:88412.52
Organism:Homo sapiens (Human)
Description:Q9Y233
Residue:1055
BDBM50430824
NameBDBM50430824
Synonyms:CHEMBL2335121
TypeSmall organic molecule
Emp. Form.C25H20FNO3
Mol. Mass.401.4296
SMILESCCOc1ccccc1-c1ccc(cc1)-c1nc2ccc(F)cc2c(C(O)=O)c1C