Reaction Details
TargetHistone deacetylase 6
LigandBDBM50430972
Substrate/Competitorn/a
Meas. Tech.ChEMBL_947308 (CHEMBL2343614)
IC50 1023±n/a nM
Citation Patil, VSodji, QHKornacki, JRMrksich, MOyelere, AK 3-Hydroxypyridin-2-thione as novel zinc binding group for selective histone deacetylase inhibition. J Med Chem56:3492-506 (2013) 
 
Histone deacetylase 6
Name:Histone deacetylase 6
Type:Chromatin regulator; hydrolase; repressor
Mol. Mass.:131381.51
Organism:Homo sapiens (Human)
Description:Q9UBN7
Residue:1215
BDBM50430972
NameBDBM50430972
Synonyms:CHEMBL2337862
TypeSmall organic molecule
Emp. Form.C16H17N5OS
Mol. Mass.327.404
SMILESCN(C)c1ccc(cc1)-n1cc(Cn2cccc(O)c2=S)nn1