Reaction Details
TargetHistone deacetylase 8
LigandBDBM50430972
Substrate/Competitorn/a
Meas. Tech.ChEMBL_947306 (CHEMBL2343612)
IC50 1868±n/a nM
Citation Patil, VSodji, QHKornacki, JRMrksich, MOyelere, AK 3-Hydroxypyridin-2-thione as novel zinc binding group for selective histone deacetylase inhibition. J Med Chem56:3492-506 (2013) 
 
Histone deacetylase 8
Name:Histone deacetylase 8
Type:Enzyme
Mol. Mass.:41749.60
Organism:Homo sapiens (Human)
Description:Q9BY41
Residue:377
BDBM50430972
NameBDBM50430972
Synonyms:CHEMBL2337862
TypeSmall organic molecule
Emp. Form.C16H17N5OS
Mol. Mass.327.404
SMILESCN(C)c1ccc(cc1)-n1cc(Cn2cccc(O)c2=S)nn1