Reaction Details
TargetHistone deacetylase 8
LigandBDBM50430978
Substrate/Competitorn/a
Meas. Tech.ChEMBL_947306 (CHEMBL2343612)
IC50 1907±n/a nM
Citation Patil, VSodji, QHKornacki, JRMrksich, MOyelere, AK 3-Hydroxypyridin-2-thione as novel zinc binding group for selective histone deacetylase inhibition. J Med Chem56:3492-506 (2013) 
 
Histone deacetylase 8
Name:Histone deacetylase 8
Type:Enzyme
Mol. Mass.:41749.60
Organism:Homo sapiens (Human)
Description:Q9BY41
Residue:377
BDBM50430978
NameBDBM50430978
Synonyms:CHEMBL2337870
TypeSmall organic molecule
Emp. Form.C19H14N2OS
Mol. Mass.318.392
SMILESOc1cccn(Cc2ccc(cc2C#N)-c2ccccc2)c1=S