Reaction Details
TargetHistone deacetylase 8
LigandBDBM50430979
Substrate/Competitorn/a
Meas. Tech.ChEMBL_947306 (CHEMBL2343612)
IC50 2075±n/a nM
Citation Patil, VSodji, QHKornacki, JRMrksich, MOyelere, AK 3-Hydroxypyridin-2-thione as novel zinc binding group for selective histone deacetylase inhibition. J Med Chem56:3492-506 (2013) 
 
Histone deacetylase 8
Name:Histone deacetylase 8
Type:Enzyme
Mol. Mass.:41749.60
Organism:Homo sapiens (Human)
Description:Q9BY41
Residue:377
BDBM50430979
NameBDBM50430979
Synonyms:CHEMBL2337872
TypeSmall organic molecule
Emp. Form.C19H14N2OS
Mol. Mass.318.392
SMILESOc1cccn(Cc2ccc(cc2)-c2ccc(cc2)C#N)c1=S