Reaction Details
TargetAlpha-ketoglutarate-dependent dioxygenase FTO
LigandBDBM50420196
Substrate/Competitorn/a
Meas. Tech.ChEMBL_947323 (CHEMBL2344107)
IC50>1000000±n/a nM
Citation Aik, WDemetriades, MHamdan, MKBagg, EAYeoh, KKLejeune, CZhang, ZMcDonough, MASchofield, CJ Structural basis for inhibition of the fat mass and obesity associated protein (FTO). J Med Chem56:3680-8 (2013) 
 
Alpha-ketoglutarate-dependent dioxygenase FTO
Name:Alpha-ketoglutarate-dependent dioxygenase FTO
Type:PROTEIN
Mol. Mass.:58263.75
Organism:Homo sapiens (Human)
Description:ChEMBL_1515854
Residue:505
BDBM50420196
NameBDBM50420196
Synonyms:D-LACTIC ACID
TypeSmall organic molecule
Emp. Form.C3H6O3
Mol. Mass.90.0779
SMILESC[C@@H](O)C(O)=O