Reaction Details
TargetAlpha-ketoglutarate-dependent dioxygenase FTO
LigandBDBM50431021
Substrate/Competitorn/a
Meas. Tech.ChEMBL_947323 (CHEMBL2344107)
IC50 120000±n/a nM
Citation Aik, WDemetriades, MHamdan, MKBagg, EAYeoh, KKLejeune, CZhang, ZMcDonough, MASchofield, CJ Structural basis for inhibition of the fat mass and obesity associated protein (FTO). J Med Chem56:3680-8 (2013) 
 
Alpha-ketoglutarate-dependent dioxygenase FTO
Name:Alpha-ketoglutarate-dependent dioxygenase FTO
Type:PROTEIN
Mol. Mass.:58263.75
Organism:Homo sapiens (Human)
Description:ChEMBL_1515854
Residue:505
BDBM50431021
NameBDBM50431021
Synonyms:CHEMBL2338324
TypeSmall organic molecule
Emp. Form.C22H17N3O5
Mol. Mass.403.3875
SMILESOC(=O)C=CC(=O)NNC(=O)c1ccc(cn1)-c1ccccc1Oc1ccccc1