Reaction Details
TargetVascular endothelial growth factor receptor 2
LigandBDBM50431025
Substrate/Competitorn/a
Meas. Tech.ChEMBL_947329 (CHEMBL2344113)
IC50>100000±n/a nM
Citation Brown, AShi, QMoore, TWYoon, YPrussia, AMaddox, CLiotta, DCShim, HSnyder, JP Monocarbonyl curcumin analogues: heterocyclic pleiotropic kinase inhibitors that mediate anticancer properties. J Med Chem56:3456-66 (2013) 
 
Vascular endothelial growth factor receptor 2
Name:Vascular endothelial growth factor receptor 2
Type:Receptor Tyrosine Kinase
Mol. Mass.:151510.97
Organism:Homo sapiens (Human)
Description:P35968
Residue:1356
BDBM50431025
NameBDBM50431025
Synonyms:CHEMBL2338335
TypeSmall organic molecule
Emp. Form.C18H19N3O
Mol. Mass.293.363
SMILESCN1C[C@H](Cc2ccccn2)C(=O)C(C1)=Cc1ccccn1