Reaction Details
TargetSerine/threonine-protein kinase Nek1
LigandBDBM50431026
Substrate/Competitorn/a
Meas. Tech.ChEMBL_947331 (CHEMBL2344115)
IC50 83000±n/a nM
Citation Brown, AShi, QMoore, TWYoon, YPrussia, AMaddox, CLiotta, DCShim, HSnyder, JP Monocarbonyl curcumin analogues: heterocyclic pleiotropic kinase inhibitors that mediate anticancer properties. J Med Chem56:3456-66 (2013) 
 
Serine/threonine-protein kinase Nek1
Name:Serine/threonine-protein kinase Nek1
Type:Protein
Mol. Mass.:142810.07
Organism:Homo sapiens (Human)
Description:n/a
Residue:1258
BDBM50431026
NameBDBM50431026
Synonyms:CHEMBL2338334
TypeSmall organic molecule
Emp. Form.C18H19N3O
Mol. Mass.293.363
SMILESCN1C[C@@H](Cc2ccccn2)C(=O)C(C1)=Cc1ccccn1