Reaction Details
Target5'-AMP-activated protein kinase catalytic subunit alpha-1/subunit beta-1/subunit gamma-1
LigandBDBM50431027
Substrate/Competitorn/a
Meas. Tech.ChEMBL_947335 (CHEMBL2344119)
IC50 26000±n/a nM
Citation Brown, AShi, QMoore, TWYoon, YPrussia, AMaddox, CLiotta, DCShim, HSnyder, JP Monocarbonyl curcumin analogues: heterocyclic pleiotropic kinase inhibitors that mediate anticancer properties. J Med Chem56:3456-66 (2013) 
 
5'-AMP-activated protein kinase catalytic subunit alpha-1/subunit beta-1/subunit gamma-1
Name:5'-AMP-activated protein kinase catalytic subunit alpha-1/subunit beta-1/subunit gamma-1
Type:n/a
Mol. Mass.:n/a
Description:n/a
Components:This complex has 0 components.
Component 1
Name:5'-AMP-activated protein kinase subunit beta-1
Synonyms:5'-AMP-activated protein kinase subunit beta-1 AMP-activated protein kinase alpha-2/beta-1/gamma-3 AMPK subunit beta-1 PRKAB1
Type:n/a
Mol. Mass.:30380.94
Organism:Homo sapiens (Human)
Description:Q9Y478
Residue:270
Component 2
Name:5'-AMP-activated protein kinase subunit gamma-1
Synonyms:5'-AMP-activated protein kinase subunit gamma-1 AMP-activated protein kinase, gamma-1 subunit AMPK gamma-1 AMPK subunit gamma-1 PRKAG1
Type:n/a
Mol. Mass.:37581.44
Organism:Homo sapiens (Human)
Description:P54619
Residue:331
Component 3
Name:5'-AMP-activated protein kinase catalytic subunit alpha-1
Synonyms:AAPK1_HUMAN AMP-activated protein kinase alpha-1/beta-2/gamma-2 AMPK subunit alpha-1 AMPK1 PRKAA1 | Tau-protein kinase PRKAA1
Type:Protein
Mol. Mass.:64023.62
Organism:Homo sapiens (Human)
Description:Q13131
Residue:559
BDBM50431027
NameBDBM50431027
Synonyms:CHEMBL2036343
TypeSmall organic molecule
Emp. Form.C17H14N2OS
Mol. Mass.294.371
SMILESO=C1\C(CSC\C1=C/c1ccccn1)=C\c1ccccn1